Bachelor oder gleichwertig
type: Concept
example: Bachelor of Science, Bachelor of Arts, Bachelorstudiengänge an Universitäten (wissenschaftliche Hochschulen, auch: Kunsthochschulen, Pädagogische Hochschulen, Theologische Hochschulen), Fachhochschulen (auch Ingenieurschulen, Hochschulen (FH) für angewandte Wissenschaften), Duale Hochschulen Baden-Württemberg und Thüringen Verwaltungsfachhochschulen, Berufsakademien, Diplom (FH), Diplomstudiengang an einer Berufsakademie
alternative label: First stage of tertiary education leading to bachelor-level degree @en
alternative label: Tertiärer Bereich bis Bachelor
alternative label: Bachelor- bzw. gleichwertiges Bildungsprogramm
scope note: Corresponds to ISCED level 6. Undergraduate or first tertiary degree or equivalent qualification. @en
scope note: Bachelor- bzw. gleichwertiges Bildungsprogramm. Entspricht ISCED-2011-Level 6 und EQF-Niveau 6.
notation: 500
top concept of: PSYNDEX-Qualifikationen
in scheme: PSYNDEX-Qualifikationen
preferred label: Bachelor-Level Degree @en

Alle Qualifikationen
type: Collection
preferred label: All qualifications @en
member: Bachelor oder gleichwertig

PSYNDEX-Qualifikationen
type: ConceptScheme
preferred label: PSYNDEX Qualifications @en
has top concept: Bachelor oder gleichwertig