Workshop
broader: Konferenzband
alternative label: Weiterbildungsseminar
alternative label: Fortbildungsseminar
alternative label: Ausbildungsseminar
scope note: Wird für praxisorientierte Aus-, Fort- und Weiterbildungsseminare verwendet. @en
notation: 18650
in scheme: methods legacy
preferred label: workshop @en
type: Concept

Konferenzband
notation: 18600
preferred label: conference proceedings @en
type: Concept
narrower: Workshop

Spezielle Kommunikationsformen
preferred label: Special Forms of Communication @en
type: Collection
member: Workshop