panel discussion
scope note: Wird für Publikationen verwendet, in denen Podiumsgespräche oder „Round Table“-Diskussionen wiedergegeben werden.
notation: 18500
top concept of: methods legacy
in scheme: methods legacy
preferred label: Podiumsdiskussion @de
type: Concept

Special Forms of Communication
preferred label: Spezielle Kommunikationsformen @de
type: Collection
member: panel discussion