discussion of science structures
scope note: Wird für Beiträge verwendet, in denen strukturelle oder politische Aspekte der Wissenschaft beschrieben oder diskutiert werden.
notation: 16300
top concept of: methods legacy
in scheme: methods legacy
preferred label: Besprechung von Forschungsstrukturen @de
type: Concept

Exercise of Profession
preferred label: Berufsausübung @de
type: Collection
member: discussion of science structures