selected readings
broader: historical source
scope note: Wird für Publikationen verwendet, in denen eine Sammlung bereits früher erschienener Beiträge vorgenommen wird.
notation: 15340
in scheme: methods legacy
preferred label: Lektüreauswahl @de
type: Concept

History
preferred label: Geschichte @de
type: Collection
member: selected readings

historical source
notation: 15300
preferred label: Historische Quelle @de
type: Concept
narrower: selected readings