patient information
notation: 11600
preferred label: Informationen für Betroffene @de
type: Concept

self-help guide
related: patient information
scope note: Wird für Ratgeberliteratur vergeben, die sich speziell **an Laien** (etwa Eltern, LehrerInnen) wendet. Ratgeberliteratur zu Krankheiten oder Behandlung **für PatientInnen und Angehörige erhalten den Study Type „11600 patient information“**.
scope note: Wird für Ratgeberliteratur vergeben, die sich speziell **an Laien** (etwa Eltern, LehrerInnen) wendet. Ratgeberliteratur zu Krankheiten oder Behandlung **für PatientInnen und Angehörige erhalten den Study Type „11600 patient information“**. @de
notation: 13500
top concept of: methods legacy
in scheme: methods legacy
preferred label: Selbsthilfe-Ratgeber @de
type: Concept

Outline
preferred label: Übersicht @de
type: Collection
member: self-help guide