literature review
narrower: systematic review
scope note: Wird für Beiträge verwendet, in denen der Kenntnisstand in einem Themenbereich auf der Grundlage einer umfassenden Sichtung und Auswertung der dazu erschienenen Literatur dargestellt wird (etwa eine narrative Literaturübersicht). Erfolgt sowohl eine präzise Darstellung der Suchstrategie, des Suchergebnisses, der Ein- und Ausschlusskriterien und der Zahl der schlussendlich berücksichtigten Quellen, wird “13110 systematic review” vergeben.
scope note: Wird für Beiträge verwendet, in denen der Kenntnisstand in einem Themenbereich auf der Grundlage einer umfassenden Sichtung und Auswertung der dazu erschienenen Literatur dargestellt wird (etwa eine narrative Literaturübersicht). Erfolgt sowohl eine präzise Darstellung der Suchstrategie, des Suchergebnisses, der Ein- und Ausschlusskriterien und der Zahl der schlussendlich berücksichtigten Quellen, wird “13110 systematic review” vergeben. @de
notation: 13100
top concept of: methods legacy
in scheme: methods legacy
preferred label: Literaturübersicht @de
type: Concept

systematic review
notation: 13110
preferred label: Systematische Literaturübersicht @de
type: Concept
broader: literature review

Outline
preferred label: Übersicht @de
type: Collection
member: literature review