assessment method description
scope note: Wird für Beiträge verwendet, in denen diagnostische Instrumente oder Erhebungsverfahren relativ detailliert vorgestellt werden. Der Study Type „assessment method description“ sollte nicht vergeben werden, wenn Diagnostik eher allgemein oder diagnostische Prozesse behandelt werden.
notation: 11200
top concept of: methods legacy
in scheme: methods legacy
preferred label: Testmethoden-Beschreibung @de
type: Concept

Methods & Clinical Resources
preferred label: Methoden & Klinische Ressourcen @de
type: Collection
member: assessment method description