methodological study
related match: https://w3id.org/zpid/vocabs/class/2260
related match: https://w3id.org/zpid/vocabs/class/2240
related match: https://w3id.org/zpid/vocabs/class/2200
scope note: Wird für Beiträge verwendet, in denen statistische Verfahren oder forschungsmethodische Ansätze vorgestellt oder diskutiert werden. Bitte beachten, dass **hier immer auch eine Klassifikation (Subject Heading)** aus den Kategorien "2200 Tests und Testen", "2240 Statistik und Mathematik" oder "2260 Forschungsmethoden und Versuchsplanung" vergeben werden muss.
notation: 11100
top concept of: methods legacy
in scheme: methods legacy
preferred label: Methodische Studie @de
type: Concept

Methods & Clinical Resources
preferred label: Methoden & Klinische Ressourcen @de
type: Collection
member: methodological study