interview
type: Concept
scope note: Wird für Publikationen verwendet, in denen Interviews oder Diskussionen zwischen zwei GesprächspartnerInnen wiedergegeben werden.
notation: 18400
top concept of: methods legacy
in scheme: methods legacy
preferred label: Interview @de

Special Forms of Communication
type: Collection
preferred label: Spezielle Kommunikationsformen @de
member: interview