bibliography
type: Concept
narrower: link collection
scope note: Wird für Bibliographien zu einem Themenbereich oder zum Werk eines Autors verwendet.
notation: 17300
top concept of: methods legacy
in scheme: methods legacy
preferred label: Literaturliste @de

link collection
type: Concept
notation: 17350
preferred label: Linksammlung @de
broader: bibliography

Resources
type: Collection
preferred label: Ressourcen @de
member: bibliography