dictionary
type: Concept
scope note: Wird für Wörterbücher und Glossare verwendet.
notation: 17200
top concept of: methods legacy
in scheme: methods legacy
preferred label: Wortliste @de

Resources
type: Collection
preferred label: Ressourcen @de
member: dictionary