directory
type: Concept
scope note: Wird für Verzeichnisse von Organisationen und ExpertInnen (etwa therapeutische Institutionen, PsychologInnen, soziale Dienste, Selbsthilfegruppen) verwendet.
notation: 17100
top concept of: methods legacy
in scheme: methods legacy
preferred label: Verzeichnis @de

Resources
type: Collection
preferred label: Ressourcen @de
member: directory