professional policies/standards
type: Concept
scope note: Wird für Beiträge verwendet, in denen 1. Curricula, Standards, Richtlinien oder Gesetzestexte für die Ausbildung, Fortbildung, Weiterbildung und Berufsausübung in psychologischen, psychosozialen und medizinischen Arbeitsfeldern oder 2. praktische Aspekte der Berufsausübung in diesen Bereichen (etwa berufliche Identität, interdisziplinäre Kooperation, Therapeutenrolle) behandelt werden.
scope note: Wird für Beiträge verwendet, in denen 1. Curricula, Standards, Richtlinien oder Gesetzestexte für die Ausbildung, Fortbildung, Weiterbildung und Berufsausübung in psychologischen, psychosozialen und medizinischen Arbeitsfeldern oder 2. praktische Aspekte der Berufsausübung in diesen Bereichen (etwa berufliche Identität, interdisziplinäre Kooperation, Therapeutenrolle) behandelt werden. @de
notation: 16100
top concept of: methods legacy
in scheme: methods legacy
preferred label: Berufs-Prinzipien/-Standards @de

Exercise of Profession
type: Collection
preferred label: Berufsausübung @de
member: professional policies/standards