reprint
type: Concept
broader: historical source
scope note: Wird für Wiederveröffentlichungen von psychologiehistorisch bedeutsamen klassischen Publikationen verwendet.
notation: 15320
in scheme: methods legacy
preferred label: Nachdruck @de

historical source
type: Concept
notation: 15300
preferred label: Historische Quelle @de
narrower: reprint

History
type: Collection
preferred label: Geschichte @de
member: reprint