laudation
type: Concept
broader: biography
scope note: Wird für Beiträge verwendet, in denen die Verdienste von bekannten Persönlichkeiten gewürdigt werden.
notation: 15240
in scheme: methods legacy
preferred label: Laudatio @de

biography
type: Concept
notation: 15200
preferred label: Biographie @de
narrower: laudation

History
type: Collection
preferred label: Geschichte @de
member: laudation