assessment method description
type: Concept
notation: 11200
preferred label: Testmethoden-Beschreibung @de

test review
type: Concept
related: assessment method description
broader: book/media review
scope note: Wird für Veröffentlichungen vergeben, in denen einzelne psychologische Testverfahren einer wertenden Beurteilung unterzogen (rezensiert) werden. Werden die Testverfahren lediglich vorgestellt, wird der Study Type „11200 assessment method description“ vergeben.
scope note: Wird für Veröffentlichungen vergeben, in denen einzelne psychologische Testverfahren einer wertenden Beurteilung unterzogen (rezensiert) werden. Werden die Testverfahren lediglich vorgestellt, wird der Study Type „11200 assessment method description“ vergeben. @de
notation: 14310
in scheme: methods legacy
preferred label: Testrezension @de

book/media review
type: Concept
notation: 14300
preferred label: Buch-/Medienrezension @de
narrower: test review

Reference
type: Collection
preferred label: Bezug @de
member: test review