errata
type: Concept
scope note: Wird für Korrekturen früherer Publikationen verwendet.
notation: 14200
top concept of: methods legacy
in scheme: methods legacy
preferred label: Errata @de

Reference
type: Collection
preferred label: Bezug @de
member: errata