comment appended
type: Concept
broader: comment
scope note: Wird für Dokumente vergeben, die mit Kommentaren anderer AutorInnen versehen sind; wird in der Regel als nachgeordneter Study Type vergeben.
notation: 14120
in scheme: methods legacy
preferred label: Mit angehängtem Kommentar @de

comment
type: Concept
notation: 14100
preferred label: Kommentar @de
narrower: comment appended

Reference
type: Collection
preferred label: Bezug @de
member: comment appended