educational audiovisual media
type: Concept
scope note: Wird für audiovisuelle Medien verwendet, die als Lehrmaterialien didaktisch aufbereitet sind bzw. primär Ausbildungszwecken dienen.
notation: 13600
top concept of: methods legacy
in scheme: methods legacy
preferred label: Audiovisuelles Lehrmedium @de

Outline
type: Collection
preferred label: Übersicht @de
member: educational audiovisual media