textbook
type: Concept
scope note: Wird für Lehrbücher verwendet, in denen spezifische Themen in einführender oder überblicksartiger Form unter besonderer Berücksichtigung **didaktischer Ziele** dargestellt werden.
notation: 13400
top concept of: methods legacy
in scheme: methods legacy
preferred label: Lehrbuch @de

Outline
type: Collection
preferred label: Übersicht @de
member: textbook