handbook
type: Concept
scope note: Wird für Referenzwerke verwendet, in denen über die Inhalte eines Wissensgebietes in systematischer und lexikalischer Form informiert wird.
notation: 13300
top concept of: methods legacy
in scheme: methods legacy
preferred label: Handbuch @de

Outline
type: Collection
preferred label: Übersicht @de
member: handbook