theoretical discussion
type: Concept
notation: 12200
preferred label: Theoretische Erörterung @de

overview
type: Concept
related: theoretical discussion
scope note: Wird für Beiträge verwendet, in denen zum Zwecke der Orientierung eine Einführung oder Übersicht zu einer Thematik (Theorien, Methoden, Empirie) gegeben wird. Hierzu zählen auch selektive Literaturübersichten ohne umfassende Sichtung sämtlicher relevanter Quellen. Steht weniger die Absicht im Vordergrund, über Themen und Inhalte zu informieren, sondern **persönliche oder fachliche Meinungen und Überzeugungen** auszudrücken, bzw. zur Diskussion zu stellen, ist die Arbeit mit **“12200 theoretical discussion”** zu klassifizieren.
scope note: Wird für Beiträge verwendet, in denen zum Zwecke der Orientierung eine Einführung oder Übersicht zu einer Thematik (Theorien, Methoden, Empirie) gegeben wird. Hierzu zählen auch selektive Literaturübersichten ohne umfassende Sichtung sämtlicher relevanter Quellen. Steht weniger die Absicht im Vordergrund, über Themen und Inhalte zu informieren, sondern **persönliche oder fachliche Meinungen und Überzeugungen** auszudrücken, bzw. zur Diskussion zu stellen, ist die Arbeit mit **“12200 theoretical discussion”** zu klassifizieren. @de
notation: 13200
top concept of: methods legacy
in scheme: methods legacy
preferred label: Überblick @de

Outline
type: Collection
preferred label: Übersicht @de
member: overview