systematic review
type: Concept
related: meta-analysis
created: 2020-10-01
broader: literature review
scope note: Wird für Beiträge verwendet, in denen der Kenntnisstand zu einem Themenbereich anhand einer vorab festgelegten und umfassenden (komprehensiven) Such- und Selektionsstrategie (z. B. entsprechend des PRISMA Statements) zusammengefasst bzw. synthetisiert wird. Diese Strategie wird in der Arbeit detailliert berichtet. Erfolgt eine **zusätzliche synthetisierende Auswertung quantitativer Studienergebnisse mittels statistischer Methoden** (u. a. Berechnung eines Gesamteffekts), so ist der Beitrag **außerdem unter “10140 meta-analysis”** zu klassifizieren.
notation: 13110
in scheme: methods legacy
preferred label: Systematische Literaturübersicht @de

meta-analysis
type: Concept
notation: 10140
preferred label: Meta-Analyse @de
related: systematic review

literature review
type: Concept
notation: 13100
preferred label: Literaturübersicht @de
narrower: systematic review

Outline
type: Collection
preferred label: Übersicht @de
member: systematic review