professional statement
type: Concept
scope note: Wird für Beiträge verwendet, in denen Autoren aufgrund fachlicher Kompetenz zu aktuellen Ereignissen oder gesellschaftlichen Phänomenen Stellung beziehen.
notation: 12400
top concept of: methods legacy
in scheme: methods legacy
preferred label: Fachliche Stellungnahme @de

Theories & Concepts
type: Collection
preferred label: Theorien und Konzepte @de
member: professional statement