terminological/conceptual contribution
type: Concept
scope note: Wird für Beiträge verwendet, in denen einzelne psychologische oder psychologierelevante Konstrukte definiert oder näher bestimmt werden.
notation: 12300
top concept of: methods legacy
in scheme: methods legacy
preferred label: Terminologischer/konzeptioneller Beitrag @de

Theories & Concepts
type: Collection
preferred label: Theorien und Konzepte @de
member: terminological/conceptual contribution