theoretical discussion
type: Concept
scope note: Wird für Beiträge verwendet, in denen AutorInnen ihre Auffassungen zum Publikationsthema auf der Grundlage von persönlichen theoretischen, methodischen oder fachlichen Orientierungen darstellen.
notation: 12200
top concept of: methods legacy
in scheme: methods legacy
preferred label: Theoretische Erörterung @de

Theories & Concepts
type: Collection
preferred label: Theorien und Konzepte @de
member: theoretical discussion