theoretical study
type: Concept
scope note: Wird für Beiträge verwendet, in denen Theorien oder Modelle entwickelt, weiterentwickelt oder (ausführlich) diskutiert werden.
notation: 12100
top concept of: methods legacy
in scheme: methods legacy
preferred label: Theoretische Studie @de

Theories & Concepts
type: Collection
preferred label: Theorien und Konzepte @de
member: theoretical study