patient information
type: Concept
scope note: Wird für Publikationen verwendet, die sich direkt an PatientInnen und Angehörige wenden, um über Krankheiten und Behandlungsformen sowie Möglichkeiten der Selbsthilfe zu informieren (etwa Patientenratgeber, Selbsthilfemanuale).
notation: 11600
top concept of: methods legacy
in scheme: methods legacy
preferred label: Informationen für Betroffene @de

Methods & Clinical Resources
type: Collection
preferred label: Methoden & Klinische Ressourcen @de
member: patient information