treatment program
type: Concept
scope note: Wird für Publikationen verwendet, in denen formalisierte Behandlungsprogramme in ihrem Ablauf, mit konkreten Anweisungen bezüglich der durchzuführenden Interventionen und gegebenenfalls einzusetzenden Materialien **als Durchführungsanleitung für TherapeutInnen** beschrieben werden.
notation: 11400
top concept of: methods legacy
in scheme: methods legacy
preferred label: Behandlungsprogramm @de

Methods & Clinical Resources
type: Collection
preferred label: Methoden & Klinische Ressourcen @de
member: treatment program