experience report/case study
type: Concept
notation: 10400
preferred label: Erfahrungsbericht/Fallstudie @de

intervention method description
type: Concept
related: experience report/case study
scope note: Wird für Beiträge verwendet, in denen einzelne Interventionstechniken oder integrierte Interventionsprogramme in klinischen, pädagogischen, arbeitspsychologischen oder sozialen Feldern vorgestellt werden. Beiträge, in denen ausschließlich Behandlungseinrichtungen ohne detaillierte Darstellung der einzelnen Interventionsmaßnahmen beschrieben werden, erhalten den Study Type „experience report“.
notation: 11300
top concept of: methods legacy
in scheme: methods legacy
preferred label: Behandlungsmethoden-Beschreibung @de

Methods & Clinical Resources
type: Collection
preferred label: Methoden & Klinische Ressourcen @de
member: intervention method description