experience report/case study
type: Concept
scope note: Wird für Beiträge verwendet, in denen Institutionen vorgestellt werden, Erfahrungen aus solchen Institutionen berichtet werden oder Erfahrungen mit der Durchführung von Maßnahmen in psychologischen, pädagogischen, sozialen oder medizinischen Handlungsfeldern beschrieben werden.
notation: 10400
top concept of: methods legacy
in scheme: methods legacy
preferred label: Erfahrungsbericht/Fallstudie @de

Empirical
type: Collection
preferred label: Empirie @de
member: experience report/case study