illustrative empirical data
type: Concept
scope note: Wird verwendet, wenn empirische Daten (aus eigenen oder fremden Quellen) zur Exploration, Illustration oder als Beleg für Argumente angeführt werden, ohne dass die Kriterien für eine systematische Auswertung gegeben bzw. ersichtlich sind; wird in der Regel **als nachgeordneter Study Type** vergeben.
notation: 10200
top concept of: methods legacy
in scheme: methods legacy
preferred label: Illustrative empirische Daten @de

Empirical
type: Collection
preferred label: Empirie @de
member: illustrative empirical data