qualitative empirical study
type: Concept
broader: empirical study
scope note: Wird für empirische Beiträge verwendet, in denen Daten mit qualitativen Methoden erhoben und systematisch (qualitativ und/oder quantitativ) ausgewertet werden (dazu gehören inhaltsanalytische, hermeneutische und rekonstruktive Methoden, narrative und biographische Interviewansätze sowie Verfahren der Feldforschung und teilnehmenden Beobachtung).
notation: 10130
in scheme: methods legacy
preferred label: Qualitative empirische Studie @de

empirical study
type: Concept
notation: 10100
preferred label: Empirische Studie @de
narrower: qualitative empirical study

Empirical
type: Collection
preferred label: Empirie @de
member: qualitative empirical study