quasi-experimental study
type: Concept
example: In einem Betrieb mit zwei Abteilungen soll die Hypothese geprüft werden, dass die MitarbeiterInnen unter Tageslicht im Vergleich zu künstlichem Licht (unabhängige Variable) bessere Arbeitsleistungen (abhängige Variable) erbringen und eine höhere Arbeitszufriedenheit (abhängige Variable) aufweisen. **Alle MitarbeiterInnen der einen Abteilung des Betriebs arbeiten eine Schicht unter der Bedingung Tageslicht, alle MitarbeiterInnen der anderen Abteilung arbeiten eine Schicht unter künstlichem Licht und nach Schichtende werden die Arbeitsleistung und Arbeitszufriedenheit jeweils gemessen.**
example: In einem Betrieb mit zwei Abteilungen soll die Hypothese geprüft werden, dass die MitarbeiterInnen unter Tageslicht im Vergleich zu künstlichem Licht (unabhängige Variable) bessere Arbeitsleistungen (abhängige Variable) erbringen und eine höhere Arbeitszufriedenheit (abhängige Variable) aufweisen. **Alle MitarbeiterInnen der einen Abteilung des Betriebs arbeiten eine Schicht unter der Bedingung Tageslicht, alle MitarbeiterInnen der anderen Abteilung arbeiten eine Schicht unter künstlichem Licht und nach Schichtende werden die Arbeitsleistung und Arbeitszufriedenheit jeweils gemessen.** @de
created: 2020-10-01
broader: experimental study
scope note: Wird für empirische Beiträge verwendet, bei denen die Versuchspersonen **nicht randomisiert den Untersuchungsbedingungen zugeordnet** werden, sondern durch die Auswahl bestimmter Merkmale (vorgefundene Gruppen) oder durch Selbstselektion der Versuchspersonen, die sich eine Versuchsbedingung auswählen können. Dabei werden mögliche Störvariablen kontrolliert, d. h., es werden Merkmale berücksichtigt, die einen Einfluss auf Unterschiede in der abhängigen Variable haben können.
notation: 10112
in scheme: methods legacy
preferred label: Quasi-experimentelle Studie @de

experimental study
type: Concept
notation: 10110
preferred label: Experimentelle Studie @de
narrower: quasi-experimental study

Empirical
type: Collection
preferred label: Empirie @de
member: quasi-experimental study