randomized experimental study
type: Concept
example: In einem Betrieb mit zwei Abteilungen soll die Hypothese geprüft werden, dass die MitarbeiterInnen unter Tageslicht im Vergleich zu künstlichem Licht (unabhängige Variable) bessere Arbeitsleistungen (abhängige Variable) erbringen und eine höhere Arbeitszufriedenheit (abhängige Variable) aufweisen. **Alle MitarbeiterInnen des Betriebs werden randomisiert (zufällig) auf die Bedingungen Schicht unter Tageslicht versus Schicht unter künstlichem Licht aufgeteilt und nach Schichtende werden die Arbeitsleistung und Arbeitszufriedenheit jeweils gemessen.**
example: In einem Betrieb mit zwei Abteilungen soll die Hypothese geprüft werden, dass die MitarbeiterInnen unter Tageslicht im Vergleich zu künstlichem Licht (unabhängige Variable) bessere Arbeitsleistungen (abhängige Variable) erbringen und eine höhere Arbeitszufriedenheit (abhängige Variable) aufweisen. **Alle MitarbeiterInnen des Betriebs werden randomisiert (zufällig) auf die Bedingungen Schicht unter Tageslicht versus Schicht unter künstlichem Licht aufgeteilt und nach Schichtende werden die Arbeitsleistung und Arbeitszufriedenheit jeweils gemessen.** @de
created: 2020-10-01
broader: experimental study
scope note: Wird für empirische Beiträge verwendet bei denen zur Untersuchung von Kausalhypothesen Versuchspersonen randomisiert (zufällig) den Untersuchungsbedingungen zugeordnet und dadurch in Experimental- und/oder Kontrollgruppen aufgeteilt werden (randomized controlled trial, RCT). Dazu zählen auch cluster-randomisierte Studien, bei denen Gruppen von Versuchspersonen randomisiert einer Untersuchungsbedingung zugeordnet werden (z. B. Schulklassen oder Patientinnen und Patienten einer Therapeutin bzw. eines Therapeuten. **Achtung**: Wenn die Zuordnung der Gruppen nicht randomisiert erfolgt, handelt es sich um ein quasi-experimentelles Design; siehe “10112 quasi-experimental study”). Vorexperimentelle Studien (z. B. Prä-Post-Vergleiche einer Gruppe) sind als “10100 empirical study” zu klassifizieren.
scope note: Wird für empirische Beiträge verwendet bei denen zur Untersuchung von Kausalhypothesen Versuchspersonen randomisiert (zufällig) den Untersuchungsbedingungen zugeordnet und dadurch in Experimental- und/oder Kontrollgruppen aufgeteilt werden (randomized controlled trial, RCT). Dazu zählen auch cluster-randomisierte Studien, bei denen Gruppen von Versuchspersonen randomisiert einer Untersuchungsbedingung zugeordnet werden (z. B. Schulklassen oder Patientinnen und Patienten einer Therapeutin bzw. eines Therapeuten. **Achtung**: Wenn die Zuordnung der Gruppen nicht randomisiert erfolgt, handelt es sich um ein quasi-experimentelles Design; siehe “10112 quasi-experimental study”). Vorexperimentelle Studien (z. B. Prä-Post-Vergleiche einer Gruppe) sind als “10100 empirical study” zu klassifizieren. @de
notation: 10111
in scheme: methods legacy
preferred label: Randomisierte experimentelle Studie @de

experimental study
type: Concept
notation: 10110
preferred label: Experimentelle Studie @de
narrower: randomized experimental study

Empirical
type: Collection
preferred label: Empirie @de
member: randomized experimental study