empirical study
type: Concept
narrower: multicenter study
narrower: meta-analysis
narrower: qualitative empirical study
narrower: longitudinal empirical study
narrower: experimental study
scope note: Wird für Beiträge verwendet, in denen empirische Daten systematisch erhoben und ausgewertet, Populationen empirisch gekennzeichnet, Fragestellungen empirisch geprüft oder Messverfahren auf empirischer Grundlage konstruiert und validiert werden. Diese Kategorie (10100) wird vor allem bei Korrelationsstudien, Umfragen, Befragungsstudien, Surveys, Häufigkeitsmessungen vergeben. Die spezifischeren Bezeichnungen (10110 bis 10800) werden verwendet, wenn die dort genannten Voraussetzungen gegeben sind.
scope note: Wird für Beiträge verwendet, in denen empirische Daten systematisch erhoben und ausgewertet, Populationen empirisch gekennzeichnet, Fragestellungen empirisch geprüft oder Messverfahren auf empirischer Grundlage konstruiert und validiert werden. Diese Kategorie (10100) wird vor allem bei Korrelationsstudien, Umfragen, Befragungsstudien, Surveys, Häufigkeitsmessungen vergeben. Die spezifischeren Bezeichnungen (10110 bis 10800) werden verwendet, wenn die dort genannten Voraussetzungen gegeben sind. @de
notation: 10100
top concept of: methods legacy
in scheme: methods legacy
preferred label: Empirische Studie @de

multicenter study
type: Concept
notation: 10150
preferred label: Multicenter-Studie @de
related: empirical study
broader: empirical study

meta-analysis
type: Concept
notation: 10140
preferred label: Meta-Analyse @de
broader: empirical study

qualitative empirical study
type: Concept
notation: 10130
preferred label: Qualitative empirische Studie @de
broader: empirical study

longitudinal empirical study
type: Concept
notation: 10120
preferred label: Empirische Längsschnittstudie @de
related: empirical study
broader: empirical study

experimental study
type: Concept
notation: 10110
preferred label: Experimentelle Studie @de
broader: empirical study

Empirical
type: Collection
preferred label: Empirie @de
member: empirical study