Resources
type: Collection
member: link collection
preferred label: Ressourcen @de

bibliography
type: Concept
narrower: link collection
notation: 17300
preferred label: Literaturliste @de

link collection
type: Concept
broader: bibliography
in scheme: methods legacy
notation: 17350
preferred label: Linksammlung @de
scope note: Wird für elektronische und gedruckte Sammlungen von Adressen im WWW verwendet.