History
type: Collection
member: selected readings
preferred label: Geschichte @de

historical source
type: Concept
narrower: selected readings
notation: 15300
preferred label: Historische Quelle @de

selected readings
type: Concept
broader: historical source
in scheme: methods legacy
notation: 15340
preferred label: Lektüreauswahl @de
scope note: Wird für Publikationen verwendet, in denen eine Sammlung bereits früher erschienener Beiträge vorgenommen wird.