History
type: Collection
member: obituary
preferred label: Geschichte @de

biography
type: Concept
narrower: obituary
notation: 15200
preferred label: Biographie @de

obituary
type: Concept
broader: biography
in scheme: methods legacy
notation: 15270
preferred label: Nachruf @de
scope note: Wird für Nachrufe auf bekannte Persönlichkeiten verwendet.