Yerkes-Dodson-Gesetz
definition: Beschreibt den Zusammenhang zwischen Aktivierung und Leistungsfähigkeit: die beste Leistung erbringt eine Person, wenn die Aktivierung weder zu niedrig (Unterforderung) noch zu hoch (Überforderung) ist.
created: 2022-09-01
top concept of: Klarsaurus
in scheme: Klarsaurus
preferred label: Yerkes-Dodson Law @en
type: Concept

Klarsaurus
type: ConceptScheme
has top concept: Yerkes-Dodson-Gesetz