Psychodynamische Psychotherapie
definition: Eine von vielen Psychotherapieformen zur Behandlung psychischer Störungen. In der psychodynamischen Psychotherapie stehen vor allem die unbewussten seelischen Prozesse von Personen im Fokus. Hierbei wird angenommen, dass vergangene Konflikte und Erfahrungen aktuelle psychische Beschwerden herbeiführen. Ziel ist es unter anderem, unbewusste Konflikte zu lösen.
created: 2022-10-01
top concept of: Klarsaurus
in scheme: Klarsaurus
preferred label: Psychodynamic Therapy @en
type: Concept

Klarsaurus
type: ConceptScheme
has top concept: Psychodynamische Psychotherapie