Prävalenz
definition: Die Prävalenz ist eine Zahl, die beschreibt, wie häufig beispielsweise eine Erkrankung in der Bevölkerung vorkommt.
created: 2022-09-01
alternative label: Häufigkeit
top concept of: Klarsaurus
in scheme: Klarsaurus
preferred label: Prevalence @en
type: Concept

Klarsaurus
type: ConceptScheme
has top concept: Prävalenz