Objektivität
definition: Ein wichtiges Gütekriterium in der Forschung: eine gute Studie sollte objektiv sein, das heißt, ihr Ergebnis sollte beispielweise möglichst unabhängig davon sein, wo sie stattfindet oder wer sie durchführt
created: 2022-09-01
top concept of: Klarsaurus
in scheme: Klarsaurus
preferred label: Objectivity @en
type: Concept

Klarsaurus
type: ConceptScheme
has top concept: Objektivität