Mentale Gesundheit
definition: Die Abwesenheit einzelner oder mehrerer Symptome seelischer Beeinträchtigungen
created: 2023-03-01
alternative label: Seelische Gesundheit
alternative label: Psychische Gesundheit
top concept of: Klarsaurus
in scheme: Klarsaurus
preferred label: Mental Health @en
type: Concept

Klarsaurus
type: ConceptScheme
has top concept: Mentale Gesundheit