Within-Subjects-Design
type: Concept
definition: Merkmal einer Studie, die Zusammenhänge oder Unterschiede innerhalb von Personen untersucht (zum Beispiel die Veränderung einer Person über die Zeit)
created: 2022-09-01
top concept of: Klarsaurus
in scheme: Klarsaurus
preferred label: Within-Subjects Design @en

Klarsaurus
type: ConceptScheme
has top concept: Within-Subjects-Design