Wernicke-Areal
type: Concept
definition: Ein Bereich im Gehirn, der für das Verständnis von Sprache wichtig ist
created: 2022-09-01
alternative label: Bereich für Sprachverständnis
top concept of: Klarsaurus
in scheme: Klarsaurus
preferred label: Wernicke Area @en

Klarsaurus
type: ConceptScheme
has top concept: Wernicke-Areal