Vortesterfahrung
type: Concept
definition: Ob und in welchem Ausmaß eine Person vor der Durchführung eines Tests oder einer Aufgabe schon Kontakt mit den Materialien dieses Tests oder dieser Aufgabe hatte.
created: 2023-03-01
top concept of: Klarsaurus
in scheme: Klarsaurus
preferred label: Pre-Test Experience @en

Klarsaurus
type: ConceptScheme
has top concept: Vortesterfahrung