Stichprobe
type: Concept
definition: Gesamtheit der Teilnehmenden an einer Studie
created: 2022-09-01
alternative label: Teilnehmende der Studie
top concept of: Klarsaurus
in scheme: Klarsaurus
preferred label: Sample @en

Klarsaurus
type: ConceptScheme
has top concept: Stichprobe