Protektive Faktoren
type: Concept
definition: Schutzfaktoren können dazu beitragen, dass manche Menschen trotz schwieriger Erlebnisse nicht an einer psychischen Störung erkranken. Ein Schutzfaktor ist zum Beispiel eine sichere Bindung zu den Eltern in der Kindheit.
created: 2022-09-01
alternative label: Schutzfaktoren
top concept of: Klarsaurus
in scheme: Klarsaurus
preferred label: Protective Factors @en

Klarsaurus
type: ConceptScheme
has top concept: Protektive Faktoren